Target
Dihydroorotate dehydrogenase (quinone), mitochondrial
Ligand
BDBM50071800
Substrate
Meas. Tech.
ChEMBL_1470241 (CHEMBL3413103)
IC50
>10000±n/a nM
Citation
 Zhu, JHan, LDiao, YRen, XXu, MXu, LLi, SLi, QDong, DHuang, JLiu, XZhao, ZWang, RZhu, LXu, YQian, XLi, H Design, synthesis, X-ray crystallographic analysis, and biological evaluation of thiazole derivatives as potent and selective inhibitors of human dihydroorotate dehydrogenase. J Med Chem 58:1123-39 (2015)  
Target
Name:
Dihydroorotate dehydrogenase (quinone), mitochondrial
Synonyms:
DHODH Dihydroorotate dehydrogenase Dihydroorotate dehydrogenase, mitochondrial Dihydroorotate oxidase (DHODH) | PYRD_HUMAN
Type:
Enzyme
Mol. Mass.:
42881.33
Organism:
Homo sapiens (Human)
Description:
Q02127
Residue:
395
  
Inhibitor
Name:
BDBM50071800
Synonyms:
CHEMBL3410613
Type:
Small organic molecule
Emp. Form.:
C25H22N2O3S
Mol. Mass.:
430.519
SMILES:
CCOC(=O)c1sc(Nc2ccc(cc2)-c2cccc(OC)c2)nc1-c1ccccc1
: