Target
Krueppel-like factor 10
Ligand
BDBM50071811
Substrate
Meas. Tech.
ChEMBL_1467056 (CHEMBL3411253)
IC50
112000±n/a nM
Citation
 Khedkar, SASun, XRigby, ACFeinberg, MW Discovery of small molecule inhibitors to Krüppel-like factor 10 (KLF10): implications for modulation of T regulatory cell differentiation. J Med Chem 58:1466-78 (2015)  
Target
Name:
Krueppel-like factor 10
Synonyms:
EGR-alpha KLF10_HUMAN TGFB-inducible early growth response protein 1 TIEG TIEG1 | Transforming growth factor-beta-inducible early growth response protein 1
Type:
PROTEIN
Mol. Mass.:
52579.81
Organism:
Homo sapiens (Human)
Description:
ChEMBL_109571
Residue:
480
  
Inhibitor
Name:
BDBM50071811
Synonyms:
CHEMBL3410641
Type:
Small organic molecule
Emp. Form.:
C16H16O4
Mol. Mass.:
272.2958
SMILES:
Cc1ccc(OCC(=O)c2cc(C)c(O)cc2O)cc1
: