Target
Eukaryotic translation initiation factor 2-alpha kinase 3
Ligand
BDBM50072031
Substrate
Meas. Tech.
ChEMBL_1467748 (CHEMBL3412174)
EC50
200±n/a nM
Citation
 Smith, ALAndrews, KLBeckmann, HBellon, SFBeltran, PJBooker, SChen, HChung, YAD'Angelo, NDDao, JDellamaggiore, KRJaeckel, PKendall, RLabitzke, KLong, AMMaterna-Reichelt, SMitchell, PNorman, MHPowers, DRose, MShaffer, PLWu, MMLipford, JR Discovery of 1H-pyrazol-3(2H)-ones as potent and selective inhibitors of protein kinase R-like endoplasmic reticulum kinase (PERK). J Med Chem 58:1426-41 (2015)  
Target
Name:
Eukaryotic translation initiation factor 2-alpha kinase 3
Synonyms:
E2AK3_HUMAN HsPEK PERK Pancreatic endoplasmic reticulum kinase (PERK)
Type:
Enzyme
Mol. Mass.:
125190.66
Organism:
Homo sapiens (Human)
Description:
Q9NZJ5
Residue:
1116
  
Inhibitor
Name:
BDBM50072031
Synonyms:
CHEMBL3407857
Type:
Small organic molecule
Emp. Form.:
C32H27N5O2S
Mol. Mass.:
545.654
SMILES:
CNc1nc2ccc(cc2s1)-c1c(C)ccc(C(=O)c2c(-c3ccccc3)n(C)n(-c3ccccc3)c2=O)c1N
: