Target
4-hydroxyphenylpyruvate dioxygenase
Ligand
BDBM50072264
Substrate
Meas. Tech.
ChEMBL_1468440 (CHEMBL3412604)
IC50
22±n/a nM
Citation
 Xu, YLLin, HYRuan, XYang, SGHao, GFYang, WCYang, GF Synthesis and bioevaluation of pyrazole-benzimidazolone hybrids as novel human 4-Hydroxyphenylpyruvate dioxygenase inhibitors. Eur J Med Chem 92:427-38 (2015)  
Target
Name:
4-hydroxyphenylpyruvate dioxygenase
Synonyms:
4-hydroxyphenylpyruvate dioxygenase 4HPPD HPPD_HUMAN | PPD
Type:
PROTEIN
Mol. Mass.:
44937.33
Organism:
Homo sapiens (Human)
Description:
ChEMBL_123
Residue:
393
  
Inhibitor
Name:
BDBM50072264
Synonyms:
CHEMBL3408319
Type:
Small organic molecule
Emp. Form.:
C17H20N4O3
Mol. Mass.:
328.3657
SMILES:
CCCn1c2cc(ccc2n(CC)c1=O)C(=O)c1cnn(C)c1O
: