Target
Potassium voltage-gated channel subfamily H member 2
Ligand
BDBM50072305
Substrate
Meas. Tech.
ChEMBL_1468656 (CHEMBL3413736)
IC50
17600±n/a nM
Citation
 Gomha, SMAbdulla, MMAbou-Seri, SM Identification of novel aminothiazole and aminothiadiazole conjugated cyanopyridines as selective CHK1 inhibitors. Eur J Med Chem 92:459-70 (2015)  
Target
Name:
Potassium voltage-gated channel subfamily H member 2
Synonyms:
1,3-beta-glucan synthase component GLS2 ERG Eag-related protein 1 Ether-a-go-go-related gene (HERG) Ether-a-go-go-related gene potassium channel 1 Ether-a-go-go-related gene potassium channel 1 (hERG1) Ether-a-go-go-related protein 1 H-ERG KCNH2 Potassium voltage-gated channel subfamily H member 2 (hERG) Voltage-gated potassium channel subunit Kv11.1 hERG Potassium Channel 1 | putative potassium channel subunit
Type:
Multi-pass membrane protein
Mol. Mass.:
126672.65
Organism:
Homo sapiens (Human)
Description:
Q12809
Residue:
1159
  
Inhibitor
Name:
BDBM50072305
Synonyms:
CHEMBL3408385
Type:
Small organic molecule
Emp. Form.:
C29H21N5O2S
Mol. Mass.:
503.574
SMILES:
COc1ccc(cc1)-n1nc(s\c1=N/c1nc(cc(-c2ccccc2)c1C#N)-c1ccccc1)C(C)=O
: