Target
Potassium voltage-gated channel subfamily H member 2
Ligand
BDBM50072312
Substrate
Meas. Tech.
ChEMBL_1468656 (CHEMBL3413736)
IC50
6800±n/a nM
Citation
 Gomha, SMAbdulla, MMAbou-Seri, SM Identification of novel aminothiazole and aminothiadiazole conjugated cyanopyridines as selective CHK1 inhibitors. Eur J Med Chem 92:459-70 (2015)  
Target
Name:
Potassium voltage-gated channel subfamily H member 2
Synonyms:
1,3-beta-glucan synthase component GLS2 ERG Eag-related protein 1 Ether-a-go-go-related gene (HERG) Ether-a-go-go-related gene potassium channel 1 Ether-a-go-go-related gene potassium channel 1 (hERG1) Ether-a-go-go-related protein 1 H-ERG KCNH2 Potassium voltage-gated channel subfamily H member 2 (hERG) Voltage-gated potassium channel subunit Kv11.1 hERG Potassium Channel 1 | putative potassium channel subunit
Type:
Multi-pass membrane protein
Mol. Mass.:
126672.65
Organism:
Homo sapiens (Human)
Description:
Q12809
Residue:
1159
  
Inhibitor
Name:
BDBM50072312
Synonyms:
CHEMBL3408392
Type:
Small organic molecule
Emp. Form.:
C33H22N4S
Mol. Mass.:
506.62
SMILES:
N#Cc1c(\N=c2/scc(-c3ccccc3)n2-c2ccccc2)nc(cc1-c1ccccc1)-c1ccccc1
: