Target
Proton-coupled folate transporter
Ligand
BDBM50072398
Substrate
Meas. Tech.
ChEMBL_1469597 (CHEMBL3412692)
IC50
>1000±n/a nM
Citation
 Wang, YMitchell-Ryan, SRaghavan, SGeorge, COrr, SHou, ZMatherly, LHGangjee, A Novel 5-substituted pyrrolo[2,3-d]pyrimidines as dual inhibitors of glycinamide ribonucleotide formyltransferase and 5-aminoimidazole-4-carboxamide ribonucleotide formyltransferase and as potential antitumor agents. J Med Chem 58:1479-93 (2015)  
Target
Name:
Proton-coupled folate transporter
Synonyms:
G21 Heme carrier protein 1 PCFT/HCP1 SLC46A1 | Solute carrier family 46 member 1
Type:
PROTEIN
Mol. Mass.:
49782.13
Organism:
Homo sapiens (Human)
Description:
ChEMBL_1469597
Residue:
459
  
Inhibitor
Name:
BDBM50072398
Synonyms:
CHEMBL2426245
Type:
Small organic molecule
Emp. Form.:
C17H17N5O6S
Mol. Mass.:
419.412
SMILES:
Nc1nc2[nH]cc(Cc3ccc(s3)C(=O)N[C@@H](CCC(O)=O)C(O)=O)c2c(=O)[nH]1
: