Target
Solute carrier organic anion transporter family member 1B3
Ligand
BDBM50139772
Substrate
Meas. Tech.
ChEMBL_1467097 (CHEMBL3411294)
Ki
17600±n/a nM
Citation
 Marada, VVFlörl, SKühne, ABurckhardt, GHagos, Y Interaction of human organic anion transporter polypeptides 1B1 and 1B3 with antineoplastic compounds. Eur J Med Chem 92:723-31 (2015)  
Target
Name:
Solute carrier organic anion transporter family member 1B3
Synonyms:
LST2 OATP8 SLC21A8 SO1B3_HUMAN Solute carrier organic anion transporter family member 1B3 (OATP1B3)
Type:
Protein
Mol. Mass.:
77425.75
Organism:
Homo sapiens (Human)
Description:
Q9NPD5
Residue:
702
  
Inhibitor
Name:
BDBM50139772
Synonyms:
22-oxovincaleukoblastine vincristine
Type:
Small organic molecule
Emp. Form.:
C46H56N4O10
Mol. Mass.:
824.9576
SMILES:
CC[C@]1(O)C[C@H]2CN(C1)CCc1c([nH]c3ccccc13)[C@@](C2)(C(=O)OC)c1cc2c(cc1OC)N(C=O)[C@@H]1[C@]22CCN3CC=C[C@](CC)([C@@H]23)[C@@H](OC(C)=O)[C@]1(O)C(=O)OC
: