Target
LIM domain kinase 1
Ligand
BDBM50072662
Substrate
Meas. Tech.
ChEMBL_1467118 (CHEMBL3411315)
IC50
4000±n/a nM
Citation
 Yin, YZheng, KEid, NHoward, SJeong, JHYi, FGuo, JPark, CMBibian, MWu, WHernandez, PPark, HWu, YLuo, JLLoGrasso, PVFeng, Y Bis-aryl urea derivatives as potent and selective LIM kinase (Limk) inhibitors. J Med Chem 58:1846-61 (2015)  
Target
Name:
LIM domain kinase 1
Synonyms:
LIM domain kinase 1 LIMK1_RAT Limk1
Type:
PROTEIN
Mol. Mass.:
72598.76
Organism:
Rattus norvegicus
Description:
ChEMBL_109573
Residue:
647
  
Inhibitor
Name:
BDBM50072662
Synonyms:
CHEMBL3407526
Type:
Small organic molecule
Emp. Form.:
C24H23FN6O2
Mol. Mass.:
446.4768
SMILES:
CC(C)NC(=O)c1cccc(NC(=O)Nc2ccc(cc2F)-c2ncnc3[nH]cc(C)c23)c1
: