Target
LIM domain kinase 1
Ligand
BDBM50072672
Substrate
Meas. Tech.
ChEMBL_1467101 (CHEMBL3411298)
IC50
8.0±n/a nM
Citation
 Yin, YZheng, KEid, NHoward, SJeong, JHYi, FGuo, JPark, CMBibian, MWu, WHernandez, PPark, HWu, YLuo, JLLoGrasso, PVFeng, Y Bis-aryl urea derivatives as potent and selective LIM kinase (Limk) inhibitors. J Med Chem 58:1846-61 (2015)  
Target
Name:
LIM domain kinase 1
Synonyms:
LIMK LIMK1 | LIMK1_HUMAN
Type:
Enzyme Catalytic Domain
Mol. Mass.:
72591.81
Organism:
Homo sapiens (Human)
Description:
gi_4505001
Residue:
647
  
Inhibitor
Name:
BDBM50072672
Synonyms:
CHEMBL3410056
Type:
Small organic molecule
Emp. Form.:
C24H23ClFN5O2
Mol. Mass.:
467.923
SMILES:
COCCN(C(=O)Nc1ccc(cc1F)-c1ncnc2[nH]c(C)c(C)c12)c1ccc(Cl)cc1
: