Target
Dual specificity protein kinase TTK
Ligand
BDBM50072911
Substrate
Meas. Tech.
ChEMBL_1467137 (CHEMBL3411334)
IC50
0.700000±n/a nM
Citation
 Kusakabe, KIde, NDaigo, YItoh, TYamamoto, THashizume, HNozu, KYoshida, HTadano, GTagashira, SHigashino, KOkano, YSato, YInoue, MIguchi, MKanazawa, TIshioka, YDohi, KKido, YSakamoto, SAndo, SMaeda, MHigaki, MBaba, YNakamura, Y Discovery of imidazo[1,2-b]pyridazine derivatives: selective and orally available Mps1 (TTK) kinase inhibitors exhibiting remarkable antiproliferative activity. J Med Chem 58:1760-75 (2015)  
Target
Name:
Dual specificity protein kinase TTK
Synonyms:
Dual specificity protein kinase (TTK) MPS1 Monopolar Spindle 1 (MPS1) Monopolar Spindle 1 Kinase (MPS1) TTK | TTK_HUMAN
Type:
Protein
Mol. Mass.:
97086.79
Organism:
Homo sapiens (Human)
Description:
P33981
Residue:
857
  
Inhibitor
Name:
BDBM50072911
Synonyms:
CHEMBL3410084
Type:
Small organic molecule
Emp. Form.:
C26H31F3N6O2
Mol. Mass.:
516.5585
SMILES:
CC(C)(Nc1cc(NCC2CCOCC2)c2ncc(-c3ccc(cc3)C(=O)NC3CC3)n2n1)C(F)(F)F
: