Target
Acetylcholinesterase
Ligand
BDBM50072955
Substrate
Meas. Tech.
ChEMBL_1467552 (CHEMBL3411566)
IC50
88100±n/a nM
Citation
 Mohammadi-Khanaposhtani, MSaeedi, MZafarghandi, NSMahdavi, MSabourian, RRazkenari, EKAlinezhad, HKhanavi, MForoumadi, AShafiee, AAkbarzadeh, T Potent acetylcholinesterase inhibitors: design, synthesis, biological evaluation, and docking study of acridone linked to 1,2,3-triazole derivatives. Eur J Med Chem 92:799-806 (2015)  
Target
Name:
Acetylcholinesterase
Synonyms:
ACES_ELEEL Acetylcholinesterase (EeAChE) | ache
Type:
Enzyme
Mol. Mass.:
71812.79
Organism:
Electrophorus electricus (Electric eel)
Description:
Residue:
633
  
Inhibitor
Name:
BDBM50072955
Synonyms:
CHEMBL3410474
Type:
Small organic molecule
Emp. Form.:
C23H17ClN4O
Mol. Mass.:
400.86
SMILES:
Clc1ccc2n(Cc3cn(Cc4ccccc4)nn3)c3ccccc3c(=O)c2c1
: