Target
Cannabinoid receptor 2
Ligand
BDBM50072999
Substrate
Meas. Tech.
ChEMBL_1468240 (CHEMBL3411783)
Ki
1.8±n/a nM
Citation
 Han, SZhang, FFQian, HYChen, LLPu, JBXie, XChen, JZ Design, syntheses, structure-activity relationships and docking studies of coumarin derivatives as novel selective ligands for the CB2 receptor. Eur J Med Chem 93:16-32 (2015)  
Target
Name:
Cannabinoid receptor 2
Synonyms:
CANNABINOID CB2 CB2 CB2B CNR2_HUMAN Cannabinoid CB2 receptor Cannabinoid receptor 2 (CB2R) | hCB2
Type:
G Protein-Coupled Receptor (GPCR)
Mol. Mass.:
39690.94
Organism:
Homo sapiens (Human)
Description:
P34972
Residue:
360
  
Inhibitor
Name:
BDBM50072999
Synonyms:
CHEMBL3410825
Type:
Small organic molecule
Emp. Form.:
C23H29NO4
Mol. Mass.:
383.4807
SMILES:
CCCCCOc1c(OC)ccc2C(=O)N(CCc3ccc(O)cc3)CCc12
: