Target
Cannabinoid receptor 1
Ligand
BDBM50073005
Substrate
Meas. Tech.
ChEMBL_1468239 (CHEMBL3411782)
IC50
>10000±n/a nM
Citation
 Han, SZhang, FFQian, HYChen, LLPu, JBXie, XChen, JZ Design, syntheses, structure-activity relationships and docking studies of coumarin derivatives as novel selective ligands for the CB2 receptor. Eur J Med Chem 93:16-32 (2015)  
Target
Name:
Cannabinoid receptor 1
Synonyms:
CANN6 CB-R CNR CNR1_HUMAN Cannabinoid receptor Cannabinoid receptor 1 (brain)
Type:
G Protein-Coupled Receptor (GPCR)
Mol. Mass.:
52868.96
Organism:
Homo sapiens (Human)
Description:
P21554
Residue:
472
  
Inhibitor
Name:
BDBM50073005
Synonyms:
CHEMBL3410729
Type:
Small organic molecule
Emp. Form.:
C24H25NO7
Mol. Mass.:
439.4578
SMILES:
CCCCCOc1c(OC)ccc2cc(C(=O)NCc3ccc4OCOc4c3)c(=O)oc12
: