Target
Fibroblast growth factor 2
Ligand
BDBM50073750
Substrate
Meas. Tech.
ChEMBL_1467830 (CHEMBL3412555)
Kd
5.6±n/a nM
Citation
 Miyachi, KWakao, MSuda, Y Syntheses of chondroitin sulfate tetrasaccharide structures containing 4,6-disulfate patterns and analysis of their interaction with glycosaminoglycan-binding protein. Bioorg Med Chem Lett 25:1552-5 (2015)  
Target
Name:
Fibroblast growth factor 2
Synonyms:
Basic fibroblast growth factor FGF2 FGFB Fibroblast growth factor receptor 2 (FGF-2) Heparin-binding growth factor 2
Type:
Protein
Mol. Mass.:
30803.89
Organism:
Homo sapiens (Human)
Description:
P09038
Residue:
288
  
Inhibitor
Name:
BDBM50073750
Synonyms:
CHEMBL3409454
Type:
Small organic molecule
Emp. Form.:
C48H71N4Na3O37S5
Mol. Mass.:
1525.376
SMILES:
[Na+].[Na+].[Na+].[H][C@@]1(O[C@H]2[C@@H](OS([O-])(=O)=O)[C@@H](COS([O-])(=O)=O)O[C@@]([H])(O[C@H]3[C@H](O)[C@@H](O)[C@]([H])(O[C@@H]4[C@@H](NC(C)=O)[C@H](OC[C@@H](O)[C@@H](O)[C@H](O)[C@@H](O)CNc5cccc(NC(=O)CCCCC6CCSS6)c5)O[C@H](CO)[C@@H]4OS([O-])(=O)=O)O[C@@H]3C(O)=O)[C@@H]2NC(C)=O)O[C@@H]([C@@H](O)[C@H](O)[C@H]1O)C(O)=O
: