Target
Oligo-1,6-glucosidase IMA1
Ligand
BDBM50073946
Substrate
Meas. Tech.
ChEMBL_1467867 (CHEMBL3412764)
IC50
<50000±n/a nM
Citation
 Niaz, HKashtoh, HKhan, JAKhan, AWahab, ATAlam, MTKhan, KMPerveen, SChoudhary, MI Synthesis of diethyl 4-substituted-2,6-dimethyl-1,4-dihydropyridine-3,5-dicarboxylates as a new series of inhibitors against yeasta-glucosidase. Eur J Med Chem 95:199-209 (2015)  
Target
Name:
Oligo-1,6-glucosidase IMA1
Synonyms:
α-glucosidase Alpha-glucosidase (α-glucosidase) MALX3_YEAST | Oligo-1,6-glucosidase
Type:
Protein
Mol. Mass.:
68577.59
Organism:
Saccharomyces cerevisiae S288c (Baker's yeast)
Description:
Residue:
589
  
Inhibitor
Name:
BDBM50073946
Synonyms:
CHEBI:83605 | CHEMBL3409638
Type:
Small organic molecule
Emp. Form.:
C14H21NO4
Mol. Mass.:
267.3208
SMILES:
CCOC(=O)C1=C(C)NC(C)=C(C1C)C(=O)OCC
: