Target
Orexin receptor type 2
Ligand
BDBM50074111
Substrate
Meas. Tech.
ChEMBL_1468058 (CHEMBL3413696)
IC50
119±n/a nM
Citation
 Sifferlen, TBoller, AChardonneau, ACottreel, EGatfield, JTreiber, ARoch, CJenck, FAissaoui, HWilliams, JTBrotschi, CHeidmann, BSiegrist, RBoss, C Substituted pyrrolidin-2-ones: Centrally acting orexin receptor antagonists promoting sleep. Part 2. Bioorg Med Chem Lett 25:1884-91 (2015)  
Target
Name:
Orexin receptor type 2
Synonyms:
HCRTR2 OX2R_HUMAN Orexin receptor type 2 (OR-2) Orexin receptor type 2 (OX2R) Ox-2-R | Ox2-R
Type:
Protein
Mol. Mass.:
50710.53
Organism:
Homo sapiens (Human)
Description:
O43614
Residue:
444
  
Inhibitor
Name:
BDBM50074111
Synonyms:
CHEMBL3409851
Type:
Small organic molecule
Emp. Form.:
C21H22F3NO4
Mol. Mass.:
409.3989
SMILES:
COc1cccc(OC)c1[C@@H]1C[C@@H](C)C(=O)N1Cc1ccc(OC(F)(F)F)cc1
: