Target
Orexin/Hypocretin receptor type 1
Ligand
BDBM50074112
Substrate
Meas. Tech.
ChEMBL_1468057 (CHEMBL3413695)
IC50
1200±n/a nM
Citation
 Sifferlen, TBoller, AChardonneau, ACottreel, EGatfield, JTreiber, ARoch, CJenck, FAissaoui, HWilliams, JTBrotschi, CHeidmann, BSiegrist, RBoss, C Substituted pyrrolidin-2-ones: Centrally acting orexin receptor antagonists promoting sleep. Part 2. Bioorg Med Chem Lett 25:1884-91 (2015)  
Target
Name:
Orexin/Hypocretin receptor type 1
Synonyms:
HCRTR1 OX1R_HUMAN Orexin receptor type 1 (OR 1) Orexin receptor type 1 (OX1) Orexin receptor type 1 (OxR1) | Ox1r
Type:
Protein
Mol. Mass.:
47554.50
Organism:
Homo sapiens (Human)
Description:
O43613
Residue:
425
  
Inhibitor
Name:
BDBM50074112
Synonyms:
CHEMBL3409877
Type:
Small organic molecule
Emp. Form.:
C24H20FNO4
Mol. Mass.:
405.4183
SMILES:
COc1cccc(F)c1[C@H]1C[C@H](O)C(=O)N1Cc1ccc2oc3ccccc3c2c1
: