Target
Falcipain 2
Ligand
BDBM50074136
Substrate
Meas. Tech.
ChEMBL_1468093 (CHEMBL3413866)
Ki
>10000±n/a nM
Citation
 Chakka, SKKalamuddin, MSundararaman, SWei, LMundra, SMahesh, RMalhotra, PMohmmed, AKotra, LP Identification of novel class of falcipain-2 inhibitors as potential antimalarial agents. Bioorg Med Chem 23:2221-40 (2015)  
Target
Name:
Falcipain 2
Synonyms:
Cysteine protease falcipain-2 Falcipain-2
Type:
Enzyme
Mol. Mass.:
55912.60
Organism:
Plasmodium falciparum
Description:
Recombinant falcipain-2.
Residue:
484
  
Inhibitor
Name:
BDBM50074136
Synonyms:
CHEMBL3409909
Type:
Small organic molecule
Emp. Form.:
C40H58FN5O6
Mol. Mass.:
723.9168
SMILES:
CC(C)C[C@H](NC(=O)CN1CCC(CCO)CC1)C(=O)N[C@@H](CC(C)C)C(=O)N[C@H](C(=O)N1CCC[C@H]1COc1ccc(F)cc1)c1ccccc1
: