Target
Aldo-keto reductase family 1 member B1
Ligand
BDBM50075050
Substrate
Meas. Tech.
ChEMBL_1473107 (CHEMBL3421436)
IC50
8220±n/a nM
Citation
 Maccari, ROttaną, R Targeting aldose reductase for the treatment of diabetes complications and inflammatory diseases: new insights and future directions. J Med Chem 58:2047-67 (2015)  
Target
Name:
Aldo-keto reductase family 1 member B1
Synonyms:
AKR1B1 ALDR_HUMAN AR Aldose Reductase (ALR2) Aldose reductase (AR)
Type:
Protein
Mol. Mass.:
35855.50
Organism:
Homo sapiens (Human)
Description:
P15121. 4LAU; 2IKI; 4LB4; 2FZD; 2FZ8; 1US0
Residue:
316
  
Inhibitor
Name:
BDBM50075050
Synonyms:
Alinia PH-5776
Type:
Small organic molecule
Emp. Form.:
C12H9N3O5S
Mol. Mass.:
307.282
SMILES:
CC(=O)Oc1ccccc1C(=O)Nc1ncc(s1)[N+]([O-])=O
: