Target
Muscarinic acetylcholine receptor M1
Ligand
BDBM50075201
Substrate
Meas. Tech.
ChEMBL_1473515 (CHEMBL3420198)
Kd
851±n/a nM
Citation
 Chen, XKlöckner, JHolze, JZimmermann, CSeemann, WKSchrage, RBock, AMohr, KTränkle, CHolzgrabe, UDecker, M Rational design of partial agonists for the muscarinic m1 acetylcholine receptor. J Med Chem 58:560-76 (2015)  
Target
Name:
Muscarinic acetylcholine receptor M1
Synonyms:
ACM1_HUMAN Cholinergic receptor, muscarinic 1 | Cholinergic, muscarinic M1
Type:
Protein
Mol. Mass.:
51442.54
Organism:
Homo sapiens (Human)
Description:
P11229
Residue:
460
  
Inhibitor
Name:
BDBM50075201
Synonyms:
CHEMBL3414843
Type:
Small organic molecule
Emp. Form.:
C32H37BrClFN4O4
Mol. Mass.:
676.016
SMILES:
[Br-].C[N+](C)(CCCCCCNC(=O)c1cn(Cc2ccccc2)c2cc(Cl)c(F)cc2c1=O)CC#CCOC1=NOCC1
: