Target
Potassium voltage-gated channel subfamily H member 2
Ligand
BDBM50076190
Substrate
Meas. Tech.
ChEMBL_1473874 (CHEMBL3419125)
IC50
10000±n/a nM
Citation
 Thoma, GSmith, ABvan Eis, MJVangrevelinghe, EBlanz, JAichholz, RLittlewood-Evans, ALee, CCLiu, HZerwes, HG Discovery and profiling of a selective and efficacious Syk inhibitor. J Med Chem 58:1950-63 (2015)  
Target
Name:
Potassium voltage-gated channel subfamily H member 2
Synonyms:
1,3-beta-glucan synthase component GLS2 ERG Eag-related protein 1 Ether-a-go-go-related gene (HERG) Ether-a-go-go-related gene potassium channel 1 Ether-a-go-go-related gene potassium channel 1 (hERG1) Ether-a-go-go-related protein 1 H-ERG KCNH2 Potassium voltage-gated channel subfamily H member 2 (hERG) Voltage-gated potassium channel subunit Kv11.1 hERG Potassium Channel 1 | putative potassium channel subunit
Type:
Multi-pass membrane protein
Mol. Mass.:
126672.65
Organism:
Homo sapiens (Human)
Description:
Q12809
Residue:
1159
  
Inhibitor
Name:
BDBM50076190
Synonyms:
CHEMBL3416023
Type:
Small organic molecule
Emp. Form.:
C19H23N9O
Mol. Mass.:
393.4456
SMILES:
N[C@H]1CCCC[C@H]1Nc1cnc(C(N)=O)c(Nc2cccc(c2)-n2nccn2)n1
: