Target
Tyrosine-protein kinase SYK
Ligand
BDBM50013161
Substrate
Meas. Tech.
ChEMBL_1473870 (CHEMBL3418947)
IC50
4.0±n/a nM
Citation
 Thoma, GSmith, ABvan Eis, MJVangrevelinghe, EBlanz, JAichholz, RLittlewood-Evans, ALee, CCLiu, HZerwes, HG Discovery and profiling of a selective and efficacious Syk inhibitor. J Med Chem 58:1950-63 (2015)  
Target
Name:
Tyrosine-protein kinase SYK
Synonyms:
KSYK_HUMAN Spleen Tyrosine Kinase Tyrosine-protein kinase SYK (Syk)
Type:
Enzyme
Mol. Mass.:
72079.99
Organism:
Homo sapiens (Human)
Description:
P43405
Residue:
635
  
Inhibitor
Name:
BDBM50013161
Synonyms:
CHEMBL3262356
Type:
Small organic molecule
Emp. Form.:
C21H23N7O
Mol. Mass.:
389.4536
SMILES:
N[C@H]1CCCC[C@H]1Nc1cc2nc[nH]c(=O)c2c(Nc2cccc3cc[nH]c23)n1
: