Target
Histone acetyltransferase GCN5
Ligand
BDBM50076444
Substrate
Meas. Tech.
ChEMBL_1473888 (CHEMBL3419139)
IC50
10000±n/a nM
Citation
 Dahlin, JLNissink, JWStrasser, JMFrancis, SHiggins, LZhou, HZhang, ZWalters, MA PAINS in the assay: chemical mechanisms of assay interference and promiscuous enzymatic inhibition observed during a sulfhydryl-scavenging HTS. J Med Chem 58:2091-113 (2015)  
Target
Name:
Histone acetyltransferase GCN5
Synonyms:
ADA4 GCN5 Histone acetyltransferase GCN5 | SWI9
Type:
PROTEIN
Mol. Mass.:
51069.24
Organism:
Saccharomyces cerevisiae S288c
Description:
ChEMBL_100832
Residue:
439
  
Inhibitor
Name:
BDBM50076444
Synonyms:
CHEMBL1609841
Type:
Small organic molecule
Emp. Form.:
C20H18N4O3S
Mol. Mass.:
394.447
SMILES:
COc1ccc(cc1)N1C(=O)CC(Sc2n[nH]c(n2)-c2ccc(C)cc2)C1=O
: