Target
Histone acetyltransferase p300
Ligand
BDBM50076256
Substrate
Meas. Tech.
ChEMBL_1473962 (CHEMBL3419558)
IC50
2200±n/a nM
Citation
 Dahlin, JLNissink, JWStrasser, JMFrancis, SHiggins, LZhou, HZhang, ZWalters, MA PAINS in the assay: chemical mechanisms of assay interference and promiscuous enzymatic inhibition observed during a sulfhydryl-scavenging HTS. J Med Chem 58:2091-113 (2015)  
Target
Name:
Histone acetyltransferase p300
Synonyms:
EP300 HIF1A/p300/CREB-binding protein P300
Type:
Protein
Mol. Mass.:
264223.04
Organism:
Homo sapiens (Human)
Description:
Q09472
Residue:
2414
  
Inhibitor
Name:
BDBM50076256
Synonyms:
CHEMBL3416317
Type:
Small organic molecule
Emp. Form.:
C11H4BrN7O2S2
Mol. Mass.:
410.229
SMILES:
[O-][N+](=O)c1cc(Br)c2nsnc2c1Sc1ncnc2[nH]cnc12
: