Target
Aldehyde dehydrogenase 1A1
Ligand
BDBM50076551
Substrate
Meas. Tech.
ChEMBL_1473980 (CHEMBL3419576)
IC50
920±n/a nM
Citation
 Morgan, CAHurley, TD Characterization of two distinct structural classes of selective aldehyde dehydrogenase 1A1 inhibitors. J Med Chem 58:1964-75 (2015)  
Target
Name:
Aldehyde dehydrogenase 1A1
Synonyms:
AL1A1_HUMAN ALDH-E1 ALDH1A1 Aldehyde dehydrogenase 1A1 (ALDH1A1) Aldehyde dehydrogenase family 1 member A1 (ALDH1A1) PUMB1 RalDH1 | Retinal dehydrogenase 1
Type:
Protein
Mol. Mass.:
54862.21
Organism:
Homo sapiens (Human)
Description:
Residue:
501
  
Inhibitor
Name:
BDBM50076551
Synonyms:
CHEMBL3416555
Type:
Small organic molecule
Emp. Form.:
C19H31N5O2
Mol. Mass.:
361.4817
SMILES:
CC(C)CCn1c(CN2CCC(C)CC2)nc2n(C)c(=O)n(C)c(=O)c12
: