Target
Endoplasmic reticulum aminopeptidase 1
Ligand
BDBM50077018
Substrate
Meas. Tech.
ChEMBL_1473167 (CHEMBL3418219)
IC50
2500±n/a nM
Citation
 Papakyriakou, AZervoudi, ETsoukalidou, SMauvais, FXSfyroera, GMastellos, DCvan Endert, PTheodorakis, EAVourloumis, DStratikos, E 3,4-diaminobenzoic acid derivatives as inhibitors of the oxytocinase subfamily of M1 aminopeptidases with immune-regulating properties. J Med Chem 58:1524-43 (2015)  
Target
Name:
Endoplasmic reticulum aminopeptidase 1
Synonyms:
APPILS Aminopeptidase ERAP1_HUMAN | KIAA0525
Type:
PROTEIN
Mol. Mass.:
107232.03
Organism:
Homo sapiens (Human)
Description:
ChEMBL_1473167
Residue:
941
  
Inhibitor
Name:
BDBM50077018
Synonyms:
CHEMBL3416726
Type:
Small organic molecule
Emp. Form.:
C31H35N5O4
Mol. Mass.:
541.6407
SMILES:
CCCC[C@H](N)C(=O)Nc1ccc(cc1N)C(=O)N[C@@H](Cc1c[nH]c2ccccc12)C(=O)OCc1ccccc1
: