Target
Endoplasmic reticulum aminopeptidase 1
Ligand
BDBM50076956
Substrate
Meas. Tech.
ChEMBL_1473167 (CHEMBL3418219)
IC50
>100000±n/a nM
Citation
 Papakyriakou, AZervoudi, ETsoukalidou, SMauvais, FXSfyroera, GMastellos, DCvan Endert, PTheodorakis, EAVourloumis, DStratikos, E 3,4-diaminobenzoic acid derivatives as inhibitors of the oxytocinase subfamily of M1 aminopeptidases with immune-regulating properties. J Med Chem 58:1524-43 (2015)  
Target
Name:
Endoplasmic reticulum aminopeptidase 1
Synonyms:
APPILS Aminopeptidase ERAP1_HUMAN | KIAA0525
Type:
PROTEIN
Mol. Mass.:
107232.03
Organism:
Homo sapiens (Human)
Description:
ChEMBL_1473167
Residue:
941
  
Inhibitor
Name:
BDBM50076956
Synonyms:
CHEMBL3416580
Type:
Small organic molecule
Emp. Form.:
C31H39N5O5
Mol. Mass.:
561.6719
SMILES:
COC(=O)[C@H](CCCCN)NC(=O)c1ccc(N)c(NC(=O)[C@@H](N)CCc2ccc(OCc3ccccc3)cc2)c1
: