Target
Endoplasmic reticulum aminopeptidase 2
Ligand
BDBM50077016
Substrate
Meas. Tech.
ChEMBL_1473169 (CHEMBL3418221)
IC50
6200±n/a nM
Citation
 Papakyriakou, AZervoudi, ETsoukalidou, SMauvais, FXSfyroera, GMastellos, DCvan Endert, PTheodorakis, EAVourloumis, DStratikos, E 3,4-diaminobenzoic acid derivatives as inhibitors of the oxytocinase subfamily of M1 aminopeptidases with immune-regulating properties. J Med Chem 58:1524-43 (2015)  
Target
Name:
Endoplasmic reticulum aminopeptidase 2
Synonyms:
Aminopeptidase ERAP2_HUMAN | LRAP
Type:
PROTEIN
Mol. Mass.:
110463.90
Organism:
Homo sapiens (Human)
Description:
ChEMBL_1473169
Residue:
960
  
Inhibitor
Name:
BDBM50077016
Synonyms:
CHEMBL3416723
Type:
Small organic molecule
Emp. Form.:
C25H34N4O4
Mol. Mass.:
454.5619
SMILES:
CCCC[C@H](N)C(=O)Nc1ccc(cc1N)C(=O)N[C@@H](C(C)C)C(=O)OCc1ccccc1
: