Target
Leucyl-cystinyl aminopeptidase
Ligand
BDBM50077018
Substrate
Meas. Tech.
ChEMBL_1473486 (CHEMBL3419982)
IC50
438±n/a nM
Citation
 Papakyriakou, AZervoudi, ETsoukalidou, SMauvais, FXSfyroera, GMastellos, DCvan Endert, PTheodorakis, EAVourloumis, DStratikos, E 3,4-diaminobenzoic acid derivatives as inhibitors of the oxytocinase subfamily of M1 aminopeptidases with immune-regulating properties. J Med Chem 58:1524-43 (2015)  
Target
Name:
Leucyl-cystinyl aminopeptidase
Synonyms:
Aminopeptidase Cystinyl aminopeptidase Insulin-regulated membrane aminopeptidase LCAP_HUMAN Leucyl-cystinyl aminopeptidase, pregnancy serum form Oxytocinase Placental leucine aminopeptidase
Type:
PROTEIN
Mol. Mass.:
117334.10
Organism:
Homo sapiens (Human)
Description:
ChEMBL_1473494
Residue:
1025
  
Inhibitor
Name:
BDBM50077018
Synonyms:
CHEMBL3416726
Type:
Small organic molecule
Emp. Form.:
C31H35N5O4
Mol. Mass.:
541.6407
SMILES:
CCCC[C@H](N)C(=O)Nc1ccc(cc1N)C(=O)N[C@@H](Cc1c[nH]c2ccccc12)C(=O)OCc1ccccc1
: