Target
Oxytocin receptor
Ligand
BDBM50077137
Substrate
Meas. Tech.
ChEMBL_1474007 (CHEMBL3419767)
Kd
1.9±n/a nM
Citation
 Karpenko, IAMargathe, JFRodriguez, TPflimlin, EDupuis, EHibert, MDurroux, TBonnet, D Selective nonpeptidic fluorescent ligands for oxytocin receptor: design, synthesis, and application to time-resolved FRET binding assay. J Med Chem 58:2547-52 (2015)  
Target
Name:
Oxytocin receptor
Synonyms:
OT-R OXYR_HUMAN | Oxytocin
Type:
Enzyme Catalytic Domain
Mol. Mass.:
42793.26
Organism:
Homo sapiens (Human)
Description:
Oxytocin OXTR HEK293::B2R9L7
Residue:
389
  
Inhibitor
Name:
BDBM50077137
Synonyms:
CHEMBL3416754
Type:
Small organic molecule
Emp. Form.:
C68H87ClF4N8O19S2
Mol. Mass.:
1496.037
SMILES:
[O-]C(=O)C(F)(F)F.CCN1\C(=C/C=C/C=C/C2=[N+](CC)c3cc(ccc3C2(C)C)S([O-])(=O)=O)C(C)(CCCC(=O)NCCOCCOCCOCCOCCOCCOCCOCCOCc2nnc(N3CC(C3)Oc3ccc(F)cc3Cl)n2-c2ccc(OC)[nH+]c2)c2cc(ccc12)S(O)(=O)=O
: