Target
Oxytocin receptor
Ligand
BDBM50077135
Substrate
Meas. Tech.
ChEMBL_1474007 (CHEMBL3419767)
Kd
1.4±n/a nM
Citation
 Karpenko, IAMargathe, JFRodriguez, TPflimlin, EDupuis, EHibert, MDurroux, TBonnet, D Selective nonpeptidic fluorescent ligands for oxytocin receptor: design, synthesis, and application to time-resolved FRET binding assay. J Med Chem 58:2547-52 (2015)  
Target
Name:
Oxytocin receptor
Synonyms:
OT-R OXYR_HUMAN | Oxytocin
Type:
Enzyme Catalytic Domain
Mol. Mass.:
42793.26
Organism:
Homo sapiens (Human)
Description:
Oxytocin OXTR HEK293::B2R9L7
Residue:
389
  
Inhibitor
Name:
BDBM50077135
Synonyms:
CHEMBL3416750
Type:
Small organic molecule
Emp. Form.:
C59H63ClN8O12S3
Mol. Mass.:
1207.826
SMILES:
CCN1\C(=C/C=C/C=C/C2=[N+](CC)c3cc(ccc3C2(C)C)S([O-])(=O)=O)C(C)(CCCC(=O)NCCNC(=O)CCc2ccc(cc2)S(=O)(=O)N(CC(=O)N\N=C2/C(=O)Nc3ccccc23)c2ccc(Cl)cc2)c2cc(ccc12)S(O)(=O)=O
: