Target
Sphingosine kinase 1
Ligand
BDBM50077147
Substrate
Meas. Tech.
ChEMBL_1474026 (CHEMBL3419997)
Ki
48±n/a nM
Citation
 Patwardhan, NNMorris, EAKharel, YRaje, MRGao, MTomsig, JLLynch, KRSantos, WL Structure-activity relationship studies and in vivo activity of guanidine-based sphingosine kinase inhibitors: discovery of SphK1- and SphK2-selective inhibitors. J Med Chem 58:1879-99 (2015)  
Target
Name:
Sphingosine kinase 1
Synonyms:
SK1 SPHK1 SPK Sphingosine kinase 1 (SPHK1) | Sphingosine kinase types 1 (SphK1)
Type:
Enzyme
Mol. Mass.:
42521.16
Organism:
Homo sapiens (Human)
Description:
Q9NYA1
Residue:
384
  
Inhibitor
Name:
BDBM50077147
Synonyms:
CHEMBL3416846
Type:
Small organic molecule
Emp. Form.:
C22H34ClN5O
Mol. Mass.:
419.991
SMILES:
Cl.CCCCCCCCc1ccc(cc1)-c1noc(C[C@@H]2CCCN2C(N)=N)n1
: