Target
Vasopressin V1a receptor
Ligand
BDBM50077226
Substrate
Meas. Tech.
ChEMBL_1473358 (CHEMBL3419318)
Ki
1491±n/a nM
Citation
 Ratni, HRogers-Evans, MBissantz, CGrundschober, CMoreau, JLSchuler, FFischer, HAlvarez Sanchez, RSchnider, P Discovery of highly selective brain-penetrant vasopressin 1a antagonists for the potential treatment of autism via a chemogenomic and scaffold hopping approach. J Med Chem 58:2275-89 (2015)  
Target
Name:
Vasopressin V1a receptor
Synonyms:
AVPR V1a Avpr1a V1aR Vasopressin V1a receptor
Type:
PROTEIN
Mol. Mass.:
47202.75
Organism:
Mus musculus
Description:
ChEMBL_109593
Residue:
423
  
Inhibitor
Name:
BDBM50077226
Synonyms:
CHEMBL3416879
Type:
Small organic molecule
Emp. Form.:
C20H19ClN2O
Mol. Mass.:
338.831
SMILES:
Clc1ccc2c(c[nH]c2c1)C(=O)N1CCC(CC1)c1ccccc1
: