Target
Bcl-2-like protein 1
Ligand
BDBM50078017
Substrate
Meas. Tech.
ChEMBL_1471768 (CHEMBL3417879)
Ki
3100±n/a nM
Citation
 Stornaiuolo, MLa Regina, GPassacantilli, SGrassia, GColuccia, ALa Pietra, VGiustiniano, MCassese, HDi Maro, SBrancaccio, DTaliani, SIalenti, ASilvestri, RMartini, CNovellino, EMarinelli, L Structure-based lead optimization and biological evaluation of BAX direct activators as novel potential anticancer agents. J Med Chem 58:2135-48 (2015)  
Target
Name:
Bcl-2-like protein 1
Synonyms:
Anti-apoptotic Bcl-2 protein Apoptosis regulator Bcl-X BCL2-like 1 isoform 1 BCL2L1 Bcl-2-like protein 1 (Bcl-XL) Bcl-xL/Bcl-2-binding component 3 Bcl2-antagonist of cell death (BAD)
Type:
Mitochondrion membrane; Single-pass membrane protein
Mol. Mass.:
26039.60
Organism:
Homo sapiens (Human)
Description:
Residue:
233
  
Inhibitor
Name:
BDBM50078017
Synonyms:
CHEMBL3417397
Type:
Small organic molecule
Emp. Form.:
C26H19N3OS
Mol. Mass.:
421.514
SMILES:
CC1=NN(C(=O)\C1=C\c1ccc(cc1)-c1ccccc1)c1nc(cs1)-c1ccccc1
: