Target
Arachidonate 5-lipoxygenase-activating protein
Ligand
BDBM50078031
Substrate
Meas. Tech.
ChEMBL_1471926 (CHEMBL3420841)
IC50
240±n/a nM
Citation
 Takahashi, HRiether, DBartolozzi, ABosanac, TBerger, VBinetti, RBroadwater, JChen, ZCrux, RDe Lombaert, SDave, RDines, JAFadra-Khan, TFlegg, AGarrigou, MHao, MHHuber, JHutzler, JMKerr, SKotey, ALiu, WLo, HYLoke, PLMahaney, PEMorwick, TMNapier, SOlague, APack, EPadyana, AKThomson, DSTye, HWu, LZindell, RMAbeywardane, ASimpson, T Synthesis, SAR, and series evolution of novel oxadiazole-containing 5-lipoxygenase activating protein inhibitors: discovery of 2-[4-(3-{(r)-1-[4-(2-amino-pyrimidin-5-yl)-phenyl]-1-cyclopropyl-ethyl}-[1,2,4]oxadiazol-5-yl)-pyrazol-1-yl]-N,N-dimethyl-acetamide (BI 665915). J Med Chem 58:1669-90 (2015)  
Target
Name:
Arachidonate 5-lipoxygenase-activating protein
Synonyms:
5-lipoxygenase activating protein 5-lipoxygenase/FLAP ALOX5AP MK-886-binding protein
Type:
Enzyme
Mol. Mass.:
18159.90
Organism:
Homo sapiens (Human)
Description:
P20292
Residue:
161
  
Inhibitor
Name:
BDBM50078031
Synonyms:
CHEMBL3417508
Type:
Small organic molecule
Emp. Form.:
C21H22N8O
Mol. Mass.:
402.4524
SMILES:
NCCn1cc(cn1)-c1nc(no1)C1(CCC1)c1ccc(cc1)-c1cnc(N)nc1
: