Target
Stromelysin-2
Ligand
BDBM50078189
Substrate
Meas. Tech.
ChEMBL_1472742 (CHEMBL3419052)
IC50
13±n/a nM
Citation
 Orbe, JSánchez-Arias, JARabal, ORodríguez, JASalicio, AUgarte, ABelzunce, MXu, MWu, WTan, HMa, HPáramo, JAOyarzabal, J Design, synthesis, and biological evaluation of novel matrix metalloproteinase inhibitors as potent antihemorrhagic agents: from hit identification to an optimized lead. J Med Chem 58:2465-88 (2015)  
Target
Name:
Stromelysin-2
Synonyms:
MMP10 Matrix Metalloproteinase-10 (MMP-10) STMY2
Type:
Enzyme
Mol. Mass.:
54143.02
Organism:
Homo sapiens (Human)
Description:
P09238
Residue:
476
  
Inhibitor
Name:
BDBM50078189
Synonyms:
CHEMBL3417752
Type:
Small organic molecule
Emp. Form.:
C27H33N3O6S
Mol. Mass.:
527.632
SMILES:
ONC(=O)C1(CCC2(C1)CCNCC2)S(=O)(=O)c1ccc(Oc2ccc(cc2)C(=O)N2CCCC2)cc1
: