Target
PH domain leucine-rich repeat-containing protein phosphatase 1
Ligand
BDBM50078209
Substrate
Meas. Tech.
ChEMBL_1470574 (CHEMBL3419800)
Kd
720±n/a nM
Citation
 Yan, RChuang, HCKapuriya, NChou, CCLai, PTChang, HWYang, CNKulp, SKChen, CS Exploitation of the ability of¿-tocopherol to facilitate membrane co-localization of Akt and PHLPP1 to develop PHLPP1-targeted Akt inhibitors. J Med Chem 58:2290-8 (2015)  
Target
Name:
PH domain leucine-rich repeat-containing protein phosphatase 1
Synonyms:
KIAA0606 PH domain leucine-rich repeat-containing protein phosphatase 1 PHLP1_HUMAN PHLPP1 Pleckstrin homology domain-containing family E member 1 Suprachiasmatic nucleus circadian oscillatory protein | hSCOP
Type:
PROTEIN
Mol. Mass.:
184662.78
Organism:
Homo sapiens (Human)
Description:
ChEMBL_109588
Residue:
1717
  
Inhibitor
Name:
BDBM50078209
Synonyms:
CHEMBL3414686
Type:
Small organic molecule
Emp. Form.:
C18H29NO3S
Mol. Mass.:
339.493
SMILES:
CC(C)CCCC1(C)CCc2cc(c(C)c(C)c2O1)S(N)(=O)=O
: