Target
Beta-secretase 1
Ligand
BDBM142369
Substrate
Meas. Tech.
ChEMBL_1470724 (CHEMBL3420730)
IC50
265±n/a nM
Citation
 Butler, CRBrodney, MABeck, EMBarreiro, GNolan, CEPan, FVajdos, FParris, KVarghese, AHHelal, CJLira, RDoran, SDRiddell, DRBuzon, LMDutra, JKMartinez-Alsina, LAOgilvie, KMurray, JCYoung, JMAtchison, KRobshaw, AGonzales, CWang, JZhang, YO'Neill, BT Discovery of a series of efficient, centrally efficacious BACE1 inhibitors through structure-based drug design. J Med Chem 58:2678-702 (2015)  
Target
Name:
Beta-secretase 1
Synonyms:
ASP2 Aspartyl protease 2 BACE1 Beta-secretase (BACE) Beta-secretase 1 (BACE 1) Beta-secretase 1 (BACE1) Beta-site amyloid precursor protein cleaving enzyme 1 Memapsin-2 beta-Secretase (BACE-1) | beta-Secretase (BACE1)
Type:
Protein
Mol. Mass.:
55755.10
Organism:
Homo sapiens (Human)
Description:
P56817
Residue:
501
  
Inhibitor
Name:
BDBM142369
Synonyms:
US8933221, 10
Type:
Small organic molecule
Emp. Form.:
C13H14F2N2OS
Mol. Mass.:
284.325
SMILES:
NC1=N[C@]2(COCC[C@H]2CS1)c1ccc(F)cc1F
: