Target
Baculoviral IAP repeat-containing protein 3
Ligand
BDBM50078357
Substrate
Meas. Tech.
ChEMBL_1470754 (CHEMBL3420983)
IC50
11±n/a nM
Citation
 Seigal, BAConnors, WHFraley, ABorzilleri, RMCarter, PHEmanuel, SLFargnoli, JKim, KLei, MNaglich, JGPokross, MEPosy, SLShen, HSurti, NTalbott, RZhang, YTerrett, NK The discovery of macrocyclic XIAP antagonists from a DNA-programmed chemistry library, and their optimization to give lead compounds with in vivo antitumor activity. J Med Chem 58:2855-61 (2015)  
Target
Name:
Baculoviral IAP repeat-containing protein 3
Synonyms:
API2 BIRC3_HUMAN Baculoviral IAP repeat-containing protein 3 (IAP1 BIR3) MIHC XIAP-BIR3 | cIAP1/cIAP2
Type:
Protein
Mol. Mass.:
68365.75
Organism:
Homo sapiens (Human)
Description:
Q13489
Residue:
604
  
Inhibitor
Name:
BDBM50078357
Synonyms:
CHEMBL3414724
Type:
Small organic molecule
Emp. Form.:
C70H88N16O14
Mol. Mass.:
1377.5465
SMILES:
[H][C@@]12CN(C(=O)[C@@H](NC(=O)[C@H](C)NC)C(C)C)[C@@]([H])(C1)C(=O)N[C@@H](Cc1ccccc1)C(=O)N[C@@H](Cc1ccc(OCc3cn(nn3)[C@]3([H])CN(C(=O)[C@@H](NC(=O)[C@H](C)NC)C(C)C)[C@@]([H])(C3)C(=O)N[C@@H](Cc3ccccc3)C(=O)N[C@@H](Cc3ccc(OCc4cn2nn4)cc3)C(O)=O)cc1)C(O)=O
: