Target
Baculoviral IAP repeat-containing protein 3
Ligand
BDBM50078362
Substrate
Meas. Tech.
ChEMBL_1470754 (CHEMBL3420983)
EC50
36±n/a nM
Citation
 Seigal, BAConnors, WHFraley, ABorzilleri, RMCarter, PHEmanuel, SLFargnoli, JKim, KLei, MNaglich, JGPokross, MEPosy, SLShen, HSurti, NTalbott, RZhang, YTerrett, NK The discovery of macrocyclic XIAP antagonists from a DNA-programmed chemistry library, and their optimization to give lead compounds with in vivo antitumor activity. J Med Chem 58:2855-61 (2015)  
Target
Name:
Baculoviral IAP repeat-containing protein 3
Synonyms:
API2 BIRC3_HUMAN Baculoviral IAP repeat-containing protein 3 (IAP1 BIR3) MIHC XIAP-BIR3 | cIAP1/cIAP2
Type:
Protein
Mol. Mass.:
68365.75
Organism:
Homo sapiens (Human)
Description:
Q13489
Residue:
604
  
Inhibitor
Name:
BDBM50078362
Synonyms:
CHEMBL3414718
Type:
Small organic molecule
Emp. Form.:
C37H47N9O7
Mol. Mass.:
729.8252
SMILES:
[H][C@@]12CN(C(=O)[C@@H](NC(=O)[C@H](C)NC)C(C)C)[C@@]([H])(C1)C(=O)N[C@@H](Cc1ccccc1)C(=O)N[C@@H](Cc1ccc(NC(=O)CCc3cn2nn3)cc1)C(O)=O
: