Target
Baculoviral IAP repeat-containing protein 2
Ligand
BDBM50078359
Substrate
Meas. Tech.
ChEMBL_1470755 (CHEMBL3420984)
EC50
49±n/a nM
Citation
 Seigal, BAConnors, WHFraley, ABorzilleri, RMCarter, PHEmanuel, SLFargnoli, JKim, KLei, MNaglich, JGPokross, MEPosy, SLShen, HSurti, NTalbott, RZhang, YTerrett, NK The discovery of macrocyclic XIAP antagonists from a DNA-programmed chemistry library, and their optimization to give lead compounds with in vivo antitumor activity. J Med Chem 58:2855-61 (2015)  
Target
Name:
Baculoviral IAP repeat-containing protein 2
Synonyms:
API1 BIRC2_HUMAN Cellular inhibitor of apoptosis 1 MIHB | RNF48
Type:
Protein
Mol. Mass.:
69900.47
Organism:
Homo sapiens (Human)
Description:
Q13490
Residue:
618
  
Inhibitor
Name:
BDBM50078359
Synonyms:
CHEMBL3414729
Type:
Small organic molecule
Emp. Form.:
C64H80N16O12
Mol. Mass.:
1265.42
SMILES:
[H][C@@]12CN(C(=O)[C@@H](NC(=O)[C@H](C)NC)C(C)C)[C@@]([H])(C1)C(=O)N[C@@H](Cc1ccc3ccccc3c1)C(=O)N[C@@H](Cc1cn(nn1)[C@]1([H])CN(C(=O)[C@@H](NC(=O)[C@H](C)NC)C(C)C)[C@@]([H])(C1)C(=O)N[C@@H](Cc1ccc3ccccc3c1)C(=O)N[C@@H](Cc1cn2nn1)C(O)=O)C(O)=O
: