Target
Hepatocyte growth factor receptor
Ligand
BDBM50078378
Substrate
Meas. Tech.
ChEMBL_1470882 (CHEMBL3418290)
IC50
22±n/a nM
Citation
 Peterson, EATeffera, YAlbrecht, BKBauer, DBellon, SFBoezio, ABoezio, CBroome, MAChoquette, DCopeland, KWDussault, ILewis, RLin, MHLohman, JLiu, JPotashman, MRex, KShimanovich, RWhittington, DAVaida, KRHarmange, JC Discovery of potent and selective 8-fluorotriazolopyridine c-Met inhibitors. J Med Chem 58:2417-30 (2015)  
Target
Name:
Hepatocyte growth factor receptor
Synonyms:
Hepatocyte growth factor receptor Hepatocyte growth factor receptor (c-MET) MET Met proto-oncogene (hepatocyte growth factor receptor) Tyrosine-protein kinase Met (c-Met) c-Met kinase
Type:
Protein
Mol. Mass.:
155559.73
Organism:
Homo sapiens (Human)
Description:
P08581
Residue:
1390
  
Inhibitor
Name:
BDBM50078378
Synonyms:
CHEMBL3414921
Type:
Small organic molecule
Emp. Form.:
C22H18FN5OS
Mol. Mass.:
419.475
SMILES:
COc1cnc2ccc(cc2c1)[C@H](C)c1nnc2c(F)cc(cn12)-c1cc(C)ns1
: