Target
Hepatocyte growth factor receptor
Ligand
BDBM50078387
Substrate
Meas. Tech.
ChEMBL_1470881 (CHEMBL3418289)
IC50
24±n/a nM
Citation
 Peterson, EATeffera, YAlbrecht, BKBauer, DBellon, SFBoezio, ABoezio, CBroome, MAChoquette, DCopeland, KWDussault, ILewis, RLin, MHLohman, JLiu, JPotashman, MRex, KShimanovich, RWhittington, DAVaida, KRHarmange, JC Discovery of potent and selective 8-fluorotriazolopyridine c-Met inhibitors. J Med Chem 58:2417-30 (2015)  
Target
Name:
Hepatocyte growth factor receptor
Synonyms:
Hepatocyte growth factor receptor Hepatocyte growth factor receptor (c-MET) MET Met proto-oncogene (hepatocyte growth factor receptor) Tyrosine-protein kinase Met (c-Met) c-Met kinase
Type:
Protein
Mol. Mass.:
155559.73
Organism:
Homo sapiens (Human)
Description:
P08581
Residue:
1390
  
Inhibitor
Name:
BDBM50078387
Synonyms:
CHEMBL3414740
Type:
Small organic molecule
Emp. Form.:
C22H15F3N6
Mol. Mass.:
420.3899
SMILES:
Fc1cc(cn2c(nnc12)C(F)(F)c1ccc2ncccc2c1)-c1cnn(c1)C1CC1
: