Target
Steroid 17-alpha-hydroxylase/17,20 lyase
Ligand
BDBM50078623
Substrate
Meas. Tech.
ChEMBL_1471252 (CHEMBL3418345)
IC50
>10000±n/a nM
Citation
 Hu, QYin, LAli, ACooke, AJBennett, JRatcliffe, PLo, MMMetzger, EHoyt, SHartmann, RW Novel pyridyl substituted 4,5-dihydro-[1,2,4]triazolo[4,3-a]quinolines as potent and selective aldosterone synthase inhibitors with improved in vitro metabolic stability. J Med Chem 58:2530-7 (2015)  
Target
Name:
Steroid 17-alpha-hydroxylase/17,20 lyase
Synonyms:
CP17A_HUMAN CYP17A1 Cytochrome P450 17A1 Cytochrome P450 C17 (CYP17) Cytochrome P450-C17 P450-C17 Steroid 17-alpha-Monooxygenase (CYP17) Steroid 17-alpha-monooxygenase | cytochrome P450 monooxygenase 17 alpha hydroxylase/17,20-lyase (CYP17)
Type:
Enzyme
Mol. Mass.:
57382.42
Organism:
Homo sapiens (Human)
Description:
E.coli expressing human CYP17
Residue:
508
  
Inhibitor
Name:
BDBM50078623
Synonyms:
CHEMBL3415161
Type:
Small organic molecule
Emp. Form.:
C21H15FN4
Mol. Mass.:
342.369
SMILES:
Fc1cc(cc2CCc3nnc(-c4ccccc4)n3-c12)-c1cccnc1
: