Target
Receptor-type tyrosine-protein kinase FLT3
Ligand
BDBM50078843
Substrate
Meas. Tech.
ChEMBL_1472453 (CHEMBL3420606)
IC50
78±n/a nM
Citation
 Frett, BMcConnell, NSmith, CCWang, YShah, NPLi, HY Computer aided drug discovery of highly ligand efficient, low molecular weight imidazopyridine analogs as FLT3 inhibitors. Eur J Med Chem 94:123-31 (2015)  
Target
Name:
Receptor-type tyrosine-protein kinase FLT3
Synonyms:
CD135 FL cytokine receptor FLK2 FLT3 Fetal liver kinase-2 Fms-like tyrosine kinase 3 (Flt-3) STK-1 Stem cell tyrosine kinase 1
Type:
Enzyme
Mol. Mass.:
112888.62
Organism:
Homo sapiens (Human)
Description:
P36888
Residue:
993
  
Inhibitor
Name:
BDBM50078843
Synonyms:
CHEMBL3416161
Type:
Small organic molecule
Emp. Form.:
C20H15FN2O
Mol. Mass.:
318.3443
SMILES:
COc1ccc(cc1)-c1ccn2c(cnc2c1)-c1ccc(F)cc1
: