Target
Macrophage-expressed gene 1 protein
Ligand
BDBM50078844
Substrate
Meas. Tech.
ChEMBL_1472482 (CHEMBL3420871)
IC50
5800±n/a nM
Citation
 Filosa, RPeduto, ASchaible, AMKrauth, VWeinigel, CBarz, DPetronzi, CBruno, FRoviezzo, FSpaziano, GD'Agostino, BDe Rosa, MWerz, O Novel series of benzoquinones with high potency against 5-lipoxygenase in human polymorphonuclear leukocytes. Eur J Med Chem 94:132-9 (2015)  
Target
Name:
Macrophage-expressed gene 1 protein
Synonyms:
MPEG1 Macrophage gene 1 protein Mpg-1
Type:
PROTEIN
Mol. Mass.:
78593.74
Organism:
Homo sapiens (Human)
Description:
ChEMBL_109592
Residue:
716
  
Inhibitor
Name:
BDBM50078844
Synonyms:
CHEMBL3416173
Type:
Small organic molecule
Emp. Form.:
C19H30O4
Mol. Mass.:
322.4391
SMILES:
CCCCCCCCCCCCC1=C(O)C(=O)C=C(OC)C1=O
: