Target
Adenosine receptor A3
Ligand
BDBM50079353
Substrate
Meas. Tech.
ChEMBL_1472827 (CHEMBL3419489)
Ki
248±n/a nM
Citation
 Preti, DBaraldi, PGSaponaro, GRomagnoli, RAghazadeh Tabrizi, MBaraldi, SCosconati, SBruno, ANovellino, EVincenzi, FRavani, ABorea, PAVarani, K Design, synthesis, and biological evaluation of novel 2-((2-(4-(substituted)phenylpiperazin-1-yl)ethyl)amino)-5'-N-ethylcarboxamidoadenosines as potent and selective agonists of the A2A adenosine receptor. J Med Chem 58:3253-67 (2015)  
Target
Name:
Adenosine receptor A3
Synonyms:
A3 adenosine receptor (hA3) ADORA3 | Adenosine A3 receptor (A3AR)
Type:
G Protein-Coupled Receptor (GPCR)
Mol. Mass.:
36197.32
Organism:
Homo sapiens (Human)
Description:
P0DMS8
Residue:
318
  
Inhibitor
Name:
BDBM50079353
Synonyms:
CHEMBL3416809
Type:
Small organic molecule
Emp. Form.:
C28H33N9O5
Mol. Mass.:
575.6189
SMILES:
CCNC(=O)[C@H]1O[C@H]([C@H](O)[C@@H]1O)n1cnc2c(N)nc(nc12)N1CCN(CC1)c1ccc(OCc2ccncc2)cc1
: