Target
MAP kinase-interacting serine/threonine-protein kinase 2
Ligand
BDBM50079469
Substrate
Meas. Tech.
ChEMBL_1470961 (CHEMBL3419829)
Ki
>10000±n/a nM
Citation
 Yu, MLi, PBasnet, SKKumarasiri, MDiab, STeo, TAlbrecht, HWang, S Discovery of 4-(dihydropyridinon-3-yl)amino-5-methylthieno[2,3-d]pyrimidine derivatives as potent Mnk inhibitors: synthesis, structure-activity relationship analysis and biological evaluation. Eur J Med Chem 95:116-26 (2015)  
Target
Name:
MAP kinase-interacting serine/threonine-protein kinase 2
Synonyms:
GPRK7 MAP kinase-interacting serine/threonine-protein kinase 2 (MKNK2) MAP-kinase interacting kinase 2 (MNK2) MKNK2_HUMAN | MNK2
Type:
Protein
Mol. Mass.:
51870.79
Organism:
Homo sapiens (Human)
Description:
Q9HBH9
Residue:
465
  
Inhibitor
Name:
BDBM50079469
Synonyms:
CHEMBL3417200
Type:
Small organic molecule
Emp. Form.:
C15H15N5O2S
Mol. Mass.:
329.377
SMILES:
Cc1c(sc2ncnc(Nc3cc(C)cn(C)c3=O)c12)C(N)=O
: