Target
Cholinesterase
Ligand
BDBM8961
Substrate
Meas. Tech.
ChEMBL_1471141 (CHEMBL3421031)
IC50
20±n/a nM
Citation
 Xie, SSWang, XJiang, NYu, WWang, KDLan, JSLi, ZRKong, LY Multi-target tacrine-coumarin hybrids: cholinesterase and monoamine oxidase B inhibition properties against Alzheimer's disease. Eur J Med Chem 95:153-65 (2015)  
Target
Name:
Cholinesterase
Synonyms:
BCHE CHLE_HORSE | Cholinesterase
Type:
Enzyme
Mol. Mass.:
65643.35
Organism:
Equus caballus (Horse)
Description:
P81908
Residue:
574
  
Inhibitor
Name:
BDBM8961
Synonyms:
1,2,3,4-tetrahydro-9-acridinamine 9-THA CHEMBL1337960 Cognex Tracine cid_1935 | tacrine.HCl
Type:
Small organic molecule
Emp. Form.:
C13H14N2
Mol. Mass.:
198.2637
SMILES:
Nc1c2CCCCc2nc2ccccc12
: